BDBM395237 US10308628, Compound 9
SMILES OC(=O)[C@@H]1C[C@@H](CCN1C(=O)C(c1ccccc1)c1ccccc1)N1CCCCc2ccc(F)cc12
InChI Key InChIKey=BQEULFAZSIKWLN-VPUSJEBWSA-N
Data  1 KI
  Tab Delimited (TSV)   2D SDfile   Computed 3D by Vconf -m prep SDfile
Find this compound or compounds like it in BindingDB:
Activity Spreadsheet -- Enzyme Inhibition Constant Data from BindingDB
Found 1 hit for monomerid = 395237
TargetType-2 angiotensin II receptor(Homo sapiens (Human))
Novartis
US Patent
LigandPNGBDBM395237(US10308628, Compound 9)
Affinity DataKi:  23nM. Assay description: 15 μL of [125I]CGP 42112A, at a final concentration of 0.05 nM was added to wells of assay plate.Membranes were dispersed using a 21 gauge needl...
Ligand InfoPC cidPC sid
In DepthDetails US Patent