BDBM397677 N-(5-(6-cyano-5-((1-((2,2-difluoroethyl)(methyl)amino)-1-oxopropan-2-yl)amino)pyridin-3-yl)pyrazin-2-yl)cyclopropanecarboxamide::US9994547, Example 46
SMILES CC(Nc1cc(cnc1C#N)-c1cnc(NC(=O)C2CC2)cn1)C(=O)N(C)CC(F)F
InChI Key InChIKey=UIKVLJAGIQEXMH-UHFFFAOYSA-N
Data  1 IC50
  Tab Delimited (TSV)   2D SDfile   Computed 3D by Vconf -m prep SDfile
Find this compound or compounds like it in BindingDB:
Activity Spreadsheet -- Enzyme Inhibition Constant Data from BindingDB
Found 1 hit for monomerid = 397677
TargetSerine/threonine-protein kinase TBK1(Homo sapiens (Human))
Takeda Pharmaceutical
US Patent
LigandPNGBDBM397677(N-(5-(6-cyano-5-((1-((2,2-difluoroethyl)(methyl)am...)
Affinity DataIC50:  10nM. Assay description: TBK1 inhibition is determined using a 384 well μlate format in buffer containing 20 mM Hepes, pH 7.4, 10 mM MgCl2, 1 mM EDTA, 0.01% Brij-L23, 1 ...
Ligand InfoPC cidPC sid
In DepthDetails US Patent