BDBM397744 N-(5-(6-cyano-5-((2-((2S,4R)-4-(hydroxymethyl)-2-(trifluoromethyl)pyrrolidin-1-yl)-2-oxoethyl)amino)pyridin-3-yl)pyrazin-2-yl)cyclopropanecarboxamide::US9994547, Example 113
SMILES OC[C@@H]1C[C@H](N(C1)C(=O)CNc1cc(cnc1C#N)-c1cnc(NC(=O)C2CC2)cn1)C(F)(F)F
InChI Key InChIKey=BQJWKUMTUBKCLN-XIKOKIGWSA-N
Data  1 IC50
  Tab Delimited (TSV)   2D SDfile   Computed 3D by Vconf -m prep SDfile
Find this compound or compounds like it in BindingDB:
Activity Spreadsheet -- Enzyme Inhibition Constant Data from BindingDB
Found 1 hit for monomerid = 397744
TargetSerine/threonine-protein kinase TBK1(Homo sapiens (Human))
Takeda Pharmaceutical
US Patent
LigandPNGBDBM397744(N-(5-(6-cyano-5-((2-((2S,4R)-4-(hydroxymethyl)-2-(...)
Affinity DataIC50:  25.1nM. Assay description: TBK1 inhibition is determined using a 384 well μlate format in buffer containing 20 mM Hepes, pH 7.4, 10 mM MgCl2, 1 mM EDTA, 0.01% Brij-L23, 1 ...
Ligand InfoPC cidPC sid
In DepthDetails US Patent