BDBM397772 (R)-N-(5-(6-cyano-5-((2-(2-(difluoromethyl)pyrrolidin-1-yl)-2-oxoethyl)amino)pyridin-3-yl)pyrazin-2-yl)cyclopropanecarboxamide::US9994547, Example 141
SMILES FC(F)[C@H]1CCCN1C(=O)CNc1cc(cnc1C#N)-c1cnc(NC(=O)C2CC2)cn1
InChI Key InChIKey=SWFNJZADVBIJDD-QGZVFWFLSA-N
Data  1 IC50
  Tab Delimited (TSV)   2D SDfile   Computed 3D by Vconf -m prep SDfile
Find this compound or compounds like it in BindingDB:
Activity Spreadsheet -- Enzyme Inhibition Constant Data from BindingDB
Found 1 hit for monomerid = 397772
TargetSerine/threonine-protein kinase TBK1(Homo sapiens (Human))
Takeda Pharmaceutical
US Patent
LigandPNGBDBM397772((R)-N-(5-(6-cyano-5-((2-(2-(difluoromethyl)pyrroli...)
Affinity DataIC50:  5.01nM. Assay description: TBK1 inhibition is determined using a 384 well μlate format in buffer containing 20 mM Hepes, pH 7.4, 10 mM MgCl2, 1 mM EDTA, 0.01% Brij-L23, 1 ...
Ligand InfoPC cidPC sid
In DepthDetails US Patent