BDBM398808 1-(3-(1,1-difluoro-2- hydroxyethyl)-1-phenyl-1H- pyrazol-5-yl)-3-((3S,4R)-4- (3,4-difluorophenyl)-1-(2- methoxyethyl)pyrrolidin-3- yl)urea::US10323022, Example 285
SMILES COCCN1C[C@@H](NC(=O)Nc2cc(nn2-c2ccccc2)C(F)(F)CO)[C@@H](C1)c1ccc(F)c(F)c1
InChI Key InChIKey=XIONNASWGCNVNN-GHTZIAJQSA-N
Data  1 IC50
  Tab Delimited (TSV)   2D SDfile   Computed 3D by Vconf -m prep SDfile
Find this compound or compounds like it in BindingDB:
Activity Spreadsheet -- Enzyme Inhibition Constant Data from BindingDB
Found 1 hit for monomerid = 398808
TargetHigh affinity nerve growth factor receptor(Homo sapiens (Human))
Array Biopharma
US Patent
LigandPNGBDBM398808(1-(3-(1,1-difluoro-2- hydroxyethyl)-1-phenyl-1H- p...)
Affinity DataIC50: <100nM. Assay description: Trk enzymatic selectivity was assessed using Omnia Kinase Assay reagents from Invitrogen Corp. Enzyme (TrkA from Invitrogen Corp.) and test compound ...
Ligand InfoPC cidPC sid
In DepthDetails US Patent