BDBM398810 1-((3S,4R)-4-(4-fluorophenyl)- 1-(2-methoxyethyl)pyrrolidin- 3-yl)-3-(3-(2-hydroxyethyl)-4- methyl-1-phenyl-1H-pyrazol- 5-yl)urea::US10323022, Example 287
SMILES COCCN1C[C@@H](NC(=O)Nc2c(C)c(CCO)nn2-c2ccccc2)[C@@H](C1)c1ccc(F)cc1
InChI Key InChIKey=FSFOAPJCOZHIMP-LADGPHEKSA-N
Data  1 IC50
  Tab Delimited (TSV)   2D SDfile   Computed 3D by Vconf -m prep SDfile
Find this compound or compounds like it in BindingDB:
Activity Spreadsheet -- Enzyme Inhibition Constant Data from BindingDB
Found 1 hit for monomerid = 398810
TargetHigh affinity nerve growth factor receptor(Homo sapiens (Human))
Array Biopharma
US Patent
LigandPNGBDBM398810(1-((3S,4R)-4-(4-fluorophenyl)- 1-(2-methoxyethyl)p...)
Affinity DataIC50: <100nM. Assay description: Trk enzymatic selectivity was assessed using Omnia Kinase Assay reagents from Invitrogen Corp. Enzyme (TrkA from Invitrogen Corp.) and test compound ...
Ligand InfoPC cidPC sid
In DepthDetails US Patent