BDBM398824 5-(3-(trans-4-(3-chloro-4- fluorophenyl)-1-(2- methoxyethyl)pyrrolidin-3- yl)ureido)-N,4-dimethyl-1- phenyl-1H-pyrazole-3- carboxamide::US10323022, Example 301
SMILES CNC(=O)c1nn(c(NC(=O)N[C@@H]2CN(CCOC)CC2c2ccc(F)c(Cl)c2)c1C)-c1ccccc1
InChI Key InChIKey=YQYUYCLPXZIVDB-AVKWCDSFSA-N
Data  1 IC50
  Tab Delimited (TSV)   2D SDfile   Computed 3D by Vconf -m prep SDfile
Find this compound or compounds like it in BindingDB:
Activity Spreadsheet -- Enzyme Inhibition Constant Data from BindingDB
Found 1 hit for monomerid = 398824
TargetHigh affinity nerve growth factor receptor(Homo sapiens (Human))
Array Biopharma
US Patent
LigandPNGBDBM398824(5-(3-(trans-4-(3-chloro-4- fluorophenyl)-1-(2- met...)
Affinity DataIC50: <100nM. Assay description: Trk enzymatic selectivity was assessed using Omnia Kinase Assay reagents from Invitrogen Corp. Enzyme (TrkA from Invitrogen Corp.) and test compound ...
Ligand InfoPC cidPC sid
In DepthDetails US Patent