BDBM398847 1-((3S,4R)-4-(2,4- difluorophenyl)-1-(2- methoxyethyl)pyrrolidin-3-yl)- 3-(1',4-dimethyl-1-phenyl- 1H,1'H-[3,4'-bipyrazol]-5- yl)urea::US10323022, Example 324
SMILES COCCN1C[C@@H](NC(=O)Nc2c(C)c(nn2-c2ccccc2)-c2cnn(C)c2)[C@@H](C1)c1ccc(F)cc1F
InChI Key InChIKey=IJGAKHXWJLZYNA-UKILVPOCSA-N
Data  1 IC50
  Tab Delimited (TSV)   2D SDfile   Computed 3D by Vconf -m prep SDfile
Find this compound or compounds like it in BindingDB:
Activity Spreadsheet -- Enzyme Inhibition Constant Data from BindingDB
Found 1 hit for monomerid = 398847
TargetHigh affinity nerve growth factor receptor(Homo sapiens (Human))
Array Biopharma
US Patent
LigandPNGBDBM398847(1-((3S,4R)-4-(2,4- difluorophenyl)-1-(2- methoxyet...)
Affinity DataIC50: <100nM. Assay description: Trk enzymatic selectivity was assessed using Omnia Kinase Assay reagents from Invitrogen Corp. Enzyme (TrkA from Invitrogen Corp.) and test compound ...
Ligand InfoPC cidPC sid
In DepthDetails US Patent