BDBM399566 US10323036, Compound I-9::US10793574, Compound I-9::US11220508, Compound I-9
SMILES COc1c(Nc2cc(Nc3cc(C)nc(C)n3)nc3[nH]n(C)c(=O)c23)cccc1-c1nnn(C)n1
InChI Key InChIKey=PPWRBZNRUWYZNY-UHFFFAOYSA-N
Data  3 Kd
  Tab Delimited (TSV)   2D SDfile   Computed 3D by Vconf -m prep SDfile
Find this compound or compounds like it in BindingDB:
Activity Spreadsheet -- Enzyme Inhibition Constant Data from BindingDB
Found 3 hits for monomerid = 399566
TargetNon-receptor tyrosine-protein kinase TYK2 [V731I](Homo sapiens (Human))
Nimbus Lakshmi
US Patent
LigandPNGBDBM399566(US10323036, Compound I-9 | US10793574, Compound I-...)
Affinity DataKd: <0.100nM. Assay description: Binding constants for compounds of the present invention against the JH2 domain were determined by the following protocol for a KINOMEscan® assay (Di...
Ligand InfoPC cidPC sid
In DepthDetails US Patent
TargetNon-receptor tyrosine-protein kinase TYK2 [556-888](Homo sapiens (Human))
Nimbus Lakshmi
US Patent
LigandPNGBDBM399566(US10323036, Compound I-9 | US10793574, Compound I-...)
Affinity DataKd: <0.100nM. Assay description: The binding reaction was assembled by combining 16 μl of DNA-tagged kinase extract, 3.8 μl liganded affinity beads, and 0.18 μl test c...
Ligand InfoPC cidPC sid
In DepthDetails US Patent
TargetNon-receptor tyrosine-protein kinase TYK2 [556-888](Homo sapiens (Human))
Nimbus Lakshmi
US Patent
LigandPNGBDBM399566(US10323036, Compound I-9 | US10793574, Compound I-...)
Affinity DataKd: <0.100nM. Assay description: Binding constants for compounds of the present invention against the JH2 domain were determined by the following protocol for a KINOMEscan® assay (Di...
Ligand InfoPC cidPC sid
In DepthDetails US Patent