BDBM400325 US10695337, Example 79::US9999619, Example 80
SMILES Cc1csc(c1)C(=O)N1CCC(CC1)N1CC(CC#N)(C1)n1cc(cn1)-c1ncnc2[nH]ccc12
InChI Key InChIKey=OLJTZRVGXSGXQJ-UHFFFAOYSA-N
Data  4 IC50
  Tab Delimited (TSV)   2D SDfile   Computed 3D by Vconf -m prep SDfile
Find this compound or compounds like it in BindingDB:
Activity Spreadsheet -- Enzyme Inhibition Constant Data from BindingDB
Found 4 hits for monomerid = 400325
TargetTyrosine-protein kinase JAK1 [837-1142](Homo sapiens (Human))
Incyte Holdings
US Patent
LigandPNGBDBM400325(US10695337, Example 79 | US9999619, Example 80)
Affinity DataIC50: <10nM. Assay description: Compounds herein were tested for inhibitory activity of JAK targets according to the following in vitro assay described in Park et al., Analytical Bi...
Ligand InfoPC cidPC sid
In DepthDetails US Patent
TargetTyrosine-protein kinase JAK2 [828-1132](Homo sapiens (Human))
Incyte Holdings
US Patent
LigandPNGBDBM400325(US10695337, Example 79 | US9999619, Example 80)
Affinity DataIC50: <10nM. Assay description: The catalytic domains of human JAK1 (a.a. 837-1142), Jak2 (a.a. 828-1132) and Jak3 (a.a. 781-1124) with an N-terminal His tag were expressed using ba...
Ligand InfoPC cidPC sid
In DepthDetails US Patent
TargetTyrosine-protein kinase JAK1 [837-1142](Homo sapiens (Human))
Incyte Holdings
US Patent
LigandPNGBDBM400325(US10695337, Example 79 | US9999619, Example 80)
Affinity DataIC50: <5nM. Assay description: The catalytic domains of human JAK1 (a.a. 837-1142), Jak2 (a.a. 828-1132) and Jak3 (a.a. 781-1124) with an N-terminal His tag were expressed using ba...
Ligand InfoPC cidPC sid
In DepthDetails US Patent
TargetTyrosine-protein kinase JAK2 [828-1132](Homo sapiens (Human))
Incyte Holdings
US Patent
LigandPNGBDBM400325(US10695337, Example 79 | US9999619, Example 80)
Affinity DataIC50: <5nM. Assay description: Compounds herein were tested for inhibitory activity of JAK targets according to the following in vitro assay described in Park et al., Analytical Bi...
Ligand InfoPC cidPC sid
In DepthDetails US Patent