BDBM401543 US10005769, No. 7
SMILES CN(C)C(=O)c1ccc2[nH]c(NC(=O)c3csc(n3)-c3ccc4OCCc4c3)nc2c1
InChI Key InChIKey=ZGYOWBZRFIYKKX-UHFFFAOYSA-N
Data  1 IC50
  Tab Delimited (TSV)   2D SDfile   Computed 3D by Vconf -m prep SDfile
Find this compound or compounds like it in BindingDB:
Activity Spreadsheet -- Enzyme Inhibition Constant Data from BindingDB
Found 1 hit for monomerid = 401543
TargetDual specificity tyrosine-phosphorylation-regulated kinase 1B(Homo sapiens (Human))
4Sc
US Patent
LigandPNGBDBM401543(US10005769, No. 7)
Affinity DataIC50:  1.74nM. Assay description: The substrate DYRKtide (synthetic peptide RRRFRPASPLRGPPK) was dissolved in freshly prepared Base Reaction Buffer (20 mM Hepes (pH 7.5), 10 mM MgCl2,...
Ligand InfoPC cidPC sid
In DepthDetails US Patent