BDBM401581 US10005769, No. 45
SMILES O=C(Nc1nc(n[nH]1)-c1cccnc1)c1csc(n1)-c1ccc2OCCc2c1
InChI Key InChIKey=ILXLDEALPACUJC-UHFFFAOYSA-N
Data  1 IC50
  Tab Delimited (TSV)   2D SDfile   Computed 3D by Vconf -m prep SDfile
Find this compound or compounds like it in BindingDB:
Activity Spreadsheet -- Enzyme Inhibition Constant Data from BindingDB
Found 1 hit for monomerid = 401581
TargetDual specificity tyrosine-phosphorylation-regulated kinase 1B(Homo sapiens (Human))
4Sc
US Patent
LigandPNGBDBM401581(US10005769, No. 45)
Affinity DataIC50:  2.81nM. Assay description: The substrate DYRKtide (synthetic peptide RRRFRPASPLRGPPK) was dissolved in freshly prepared Base Reaction Buffer (20 mM Hepes (pH 7.5), 10 mM MgCl2,...
Ligand InfoPC cidPC sid
In DepthDetails US Patent