BDBM403680 5-(4-((+/−)-3-Phenoxycyclohexyl)phenyl)pentanoic acid (cis-1,3-cyclohexyl isomer; Absolute Stereochemistry is Arbitrarily Drawn)::US10336684, Example 1
SMILES OC(=O)CCCCc1ccc(cc1)[C@@H]1CCC[C@@H](C1)Oc1ccccc1
InChI Key InChIKey=LLMBETGYRKJTKJ-IRLDBZIGSA-N
Data  1 EC50
  Tab Delimited (TSV)   2D SDfile   Computed 3D by Vconf -m prep SDfile
Find this compound or compounds like it in BindingDB:
Activity Spreadsheet -- Enzyme Inhibition Constant Data from BindingDB
Found 1 hit for monomerid = 403680
TargetFree fatty acid receptor 4(Homo sapiens (Human))
Bristol=Myers Squibb
US Patent
LigandPNGBDBM403680(5-(4-((+/−)-3-Phenoxycyclohexyl)phenyl)penta...)
Affinity DataEC50:  480nM. Assay description: The human and mouse GPR120-mediated intracellular phosphorylated ERK assays were also established using CHO-K1 cells stably transfected with the shor...
Ligand InfoPC cidPC sid
In DepthDetails US Patent