BDBM403682 5-(4-((+/−)-3-Isopropoxycyclohexyl)phenyl)pentanoic acid (cis-1,3-cyclohexyl isomer, Absolute Stereochemistry is Arbitrarily Drawn)::US10336684, Example 3
SMILES CC(C)O[C@H]1CCC[C@H](C1)c1ccc(CCCCC(O)=O)cc1
InChI Key InChIKey=CZVPYHZFIZVPFG-MOPGFXCFSA-N
Data  1 EC50
  Tab Delimited (TSV)   2D SDfile   Computed 3D by Vconf -m prep SDfile
Find this compound or compounds like it in BindingDB:
Activity Spreadsheet -- Enzyme Inhibition Constant Data from BindingDB
Found 1 hit for monomerid = 403682
TargetFree fatty acid receptor 4(Homo sapiens (Human))
Bristol=Myers Squibb
US Patent
LigandPNGBDBM403682(5-(4-((+/−)-3-Isopropoxycyclohexyl)phenyl)pe...)
Affinity DataEC50:  1.16E+3nM. Assay description: The human and mouse GPR120-mediated intracellular phosphorylated ERK assays were also established using CHO-K1 cells stably transfected with the shor...
Ligand InfoPC cidPC sid
In DepthDetails US Patent