BDBM403698 2-(4-(3-Phenoxycyclopentyl)phenethoxy)acetic acid (diastereomer mixture)::US10336684, Example 19
SMILES OC(=O)COCCc1ccc(cc1)C1CCC(C1)Oc1ccccc1
InChI Key InChIKey=TZDLRIRWJKHTJK-UHFFFAOYSA-N
Data  1 EC50
  Tab Delimited (TSV)   2D SDfile   Computed 3D by Vconf -m prep SDfile
Find this compound or compounds like it in BindingDB:
Activity Spreadsheet -- Enzyme Inhibition Constant Data from BindingDB
Found 1 hit for monomerid = 403698
TargetFree fatty acid receptor 4(Homo sapiens (Human))
Bristol=Myers Squibb
US Patent
LigandPNGBDBM403698(2-(4-(3-Phenoxycyclopentyl)phenethoxy)acetic acid ...)
Affinity DataEC50:  2.13E+3nM. Assay description: The human and mouse GPR120-mediated intracellular phosphorylated ERK assays were also established using CHO-K1 cells stably transfected with the shor...
Ligand InfoPC cidPC sid
In DepthDetails US Patent