BDBM403711 US10336684, Example 35
SMILES Cc1ccc(O[C@H]2CCC[C@H](C2)c2ccc(CCOCC(O)=O)cc2)cn1
InChI Key InChIKey=YILITGHXWBSRPO-UXHICEINSA-N
Data  1 EC50
  Tab Delimited (TSV)   2D SDfile   Computed 3D by Vconf -m prep SDfile
Find this compound or compounds like it in BindingDB:
Activity Spreadsheet -- Enzyme Inhibition Constant Data from BindingDB
Found 1 hit for monomerid = 403711
TargetFree fatty acid receptor 4(Homo sapiens (Human))
Bristol=Myers Squibb
US Patent
LigandPNGBDBM403711(US10336684, Example 35)
Affinity DataEC50:  1.61E+3nM. Assay description: The human and mouse GPR120-mediated intracellular phosphorylated ERK assays were also established using CHO-K1 cells stably transfected with the shor...
Ligand InfoPC cidPC sid
In DepthDetails US Patent