BDBM403716 US10336684, Example 40
SMILES OC(=O)[C@H]1C[C@@H]1CCc1ccc(cc1)[C@@H]1CCC[C@H](C1)Oc1ccccc1
InChI Key InChIKey=PBTFSZHZBADCEX-SKWRMQMOSA-N
Data  1 EC50
  Tab Delimited (TSV)   2D SDfile   Computed 3D by Vconf -m prep SDfile
Find this compound or compounds like it in BindingDB:
Activity Spreadsheet -- Enzyme Inhibition Constant Data from BindingDB
Found 1 hit for monomerid = 403716
TargetFree fatty acid receptor 4(Homo sapiens (Human))
Bristol=Myers Squibb
US Patent
LigandPNGBDBM403716(US10336684, Example 40)
Affinity DataEC50:  3.75E+3nM. Assay description: The human and mouse GPR120-mediated intracellular phosphorylated ERK assays were also established using CHO-K1 cells stably transfected with the shor...
Ligand InfoPC cidPC sid
In DepthDetails US Patent