BDBM40740 3-[(2,6-dimethoxy-8-quinolyl)amino]propyl-diethyl-amine::N-(2,6-dimethoxy-8-quinolinyl)-N',N'-diethylpropane-1,3-diamine::N-(2,6-dimethoxyquinolin-8-yl)-N',N'-diethyl-propane-1,3-diamine::N-(2,6-dimethoxyquinolin-8-yl)-N',N'-diethylpropane-1,3-diamine::cid_408413
SMILES CCN(CC)CCCNc1cc(OC)cc2ccc(OC)nc12
InChI Key InChIKey=LZPCPSXNCLLWIZ-UHFFFAOYSA-N
Data  2 IC50
  Tab Delimited (TSV)   2D SDfile   Computed 3D by Vconf -m prep SDfile
Find this compound or compounds like it in BindingDB:
Activity Spreadsheet -- Enzyme Inhibition Constant Data from BindingDB
Found 1 hit for monomerid = 40740
TargetHeat shock protein HSP 90-alpha(Homo sapiens (Human))
Emory University
Curated by PubChem BioAssay
LigandPNGBDBM40740(3-[(2,6-dimethoxy-8-quinolyl)amino]propyl-diethyl-...)
Affinity DataIC50: >5.00E+4nM. Assay description: Emory Chemistry-Biology Discovery Center Assay Overview: MLSCN Grant: 1 X01MH78953-01 Hsp90 is a chaperon with important roles in maintaining transfo...
Ligand InfoPC cidPC sid
In DepthDetails PCBioAssay