BDBM40790 Calyculin C (24)
SMILES COC[C@@H](C(O)[C@H](O)C(=O)NC(C)CC(C)c1nc(\C=C\CC2OC3(C[C@@H](O)[C@@H]2C)O[C@H]([C@H](C[C@H](O)C(C)[C@H](O)C(C)\C=C(/C)\C(\C)=C\C=C\C(\C)=C\C#N)OC)[C@H](OP(O)(O)=O)C3(C)C)co1)N(C)C
InChI Key InChIKey=MDHVPFKPZGGNLB-ZECJXGQESA-N
Data  2 IC50
  Tab Delimited (TSV)   2D SDfile   Computed 3D by Vconf -m prep SDfile
Find this compound or compounds like it in BindingDB:
Activity Spreadsheet -- Enzyme Inhibition Constant Data from BindingDB
Found 2 hits for monomerid = 40790
TargetSerine/threonine-protein phosphatase 2A activator(Homo sapiens (Human))
The University of Tokyo
LigandPNGBDBM40790(Calyculin C (24))
Affinity DataIC50:  2.60nM. Assay description: Protein phosphatase inhibitory activity of calyculin derivatives.
In DepthDetails ArticlePubMed
TargetProtein phosphatase 1 regulatory subunit 1A(Homo sapiens (Human))
The University of Tokyo
LigandPNGBDBM40790(Calyculin C (24))
Affinity DataIC50:  29nM. Assay description: Protein phosphatase inhibitory activity of calyculin derivatives.
In DepthDetails ArticlePubMed