BDBM408771 US10358436, Example A176
SMILES CC(C)CCN1C(=O)[C@@]2(C[C@H]2c2ccc3c(\C=C\c4ccc(CN(C)C)cc4)n[nH]c3c2)c2ccccc12
InChI Key
Data  3 IC50
  Tab Delimited (TSV)   2D SDfile   Computed 3D by Vconf -m prep SDfile
Find this compound or compounds like it in BindingDB:
Activity Spreadsheet -- Enzyme Inhibition Constant Data from BindingDB
Found 3 hits for monomerid = 408771
TargetSerine/threonine-protein kinase PLK4 [1-391](Homo sapiens (Human))
University Health Network
US Patent
LigandPNGBDBM408771(US10358436, Example A176)
Affinity DataIC50: <100nM. Assay description: Active PLK4 was purified from an E. coli expression system as an amino terminal GST fusion of residues 1-391 of human PLK4. The protein was purified ...
Ligand InfoPC cidPC sid
In DepthDetails US Patent
TargetAurora kinase B(Homo sapiens (Human))
University Health Network
US Patent
LigandPNGBDBM408771(US10358436, Example A176)
Affinity DataIC50:  550nM. Assay description: Aurora B inhibition was determined using the Z-Lyte assay kit from Invitrogen. The assay was performed using the recommended manufacturer's instr...
Ligand InfoPC cidPC sid
In DepthDetails US Patent
TargetAurora kinase A(Homo sapiens (Human))
University Health Network
US Patent
LigandPNGBDBM408771(US10358436, Example A176)
Affinity DataIC50: <500nM. Assay description: Aurora A inhibition was determined using the Z-Lyte assay kit from Invitrogen. The assay was performed using the recommended manufacturer's instr...
Ligand InfoPC cidPC sid
In DepthDetails US Patent