BDBM410725 US10377772, Compound N26
SMILES Fc1cc(Cl)c2OC[C@@H]3CCCN3CCNc3ccn4ncc(-c1c2)c4n3
InChI Key InChIKey=OVCMCVWMAVWHCY-LBPRGKRZSA-N
Data  1 IC50
  Tab Delimited (TSV)   2D SDfile   Computed 3D by Vconf -m prep SDfile
Find this compound or compounds like it in BindingDB:
Activity Spreadsheet -- Enzyme Inhibition Constant Data from BindingDB
Found 1 hit for monomerid = 410725
TargetLeucine-rich repeat serine/threonine-protein kinase 2(Homo sapiens (Human))
Oncodesign
US Patent
LigandPNGBDBM410725(US10377772, Compound N26)
Affinity DataIC50: <100nM. Assay description: The inhibition of LRRK2 kinase was assessed using LRRK2 recombinant protein in an in vitro peptide-based kinase assay.ProtocolA radiometric protein k...
Ligand InfoPC cidPC sid
In DepthDetails US Patent