BDBM410760 US10377772, Compound N61
SMILES CN1[C@@H]2CCN(C2)CCOc2ccc(F)c(c2)-c2cnn3ccc1nc23
InChI Key InChIKey=SUMUZLGGTURAOO-CYBMUJFWSA-N
Data  1 IC50
  Tab Delimited (TSV)   2D SDfile   Computed 3D by Vconf -m prep SDfile
Find this compound or compounds like it in BindingDB:
Activity Spreadsheet -- Enzyme Inhibition Constant Data from BindingDB
Found 1 hit for monomerid = 410760
TargetLeucine-rich repeat serine/threonine-protein kinase 2(Homo sapiens (Human))
Oncodesign
US Patent
LigandPNGBDBM410760(US10377772, Compound N61)
Affinity DataIC50: <100nM. Assay description: The inhibition of LRRK2 kinase was assessed using LRRK2 recombinant protein in an in vitro peptide-based kinase assay.ProtocolA radiometric protein k...
Ligand InfoPC cidPC sid
In DepthDetails US Patent