BDBM412473 (Z)-methyl 4-(1-(6-(5-fluoro-4- methylnicotinamido)pyridin-3- yl)prop-1-en-1-yl)benzoate::US10399967, Compound 104
SMILES COC(=O)c1ccc(cc1)C(=C\C)\c1ccc(NC(=O)c2cncc(F)c2C)nc1
InChI Key InChIKey=YASSXIMUCLLCDR-LMXLVEHLSA-N
Data  1 IC50
  Tab Delimited (TSV)   2D SDfile   Computed 3D by Vconf -m prep SDfile
Find this compound or compounds like it in BindingDB:
Activity Spreadsheet -- Enzyme Inhibition Constant Data from BindingDB
Found 1 hit for monomerid = 412473
TargetInterleukin-2(Homo sapiens (Human))
Prcl Research
US Patent
LigandPNGBDBM412473((Z)-methyl 4-(1-(6-(5-fluoro-4- methylnicotinamido...)
Affinity DataIC50:  18nM. Assay description: Human peripheral blood mononuclear cells (PBMCs) are prepared from heparinized human blood by separation over a Ficoll density gradient.PBMCs are sti...
Ligand Info
In DepthDetails US Patent