BDBM412482 N-(5-(2-chloro-5-(1-methyl-1H- pyrazol-4-yl)phenyl)pyridin-2-yl)-5- fluoro-4-methylnicotinamide::US10399967, Compound 115
SMILES Cc1c(F)cncc1C(=O)Nc1ccc(cn1)-c1cc(ccc1Cl)-c1cnn(C)c1
InChI Key InChIKey=ZHPKIPDWBIKVIJ-UHFFFAOYSA-N
Data  1 IC50
  Tab Delimited (TSV)   2D SDfile   Computed 3D by Vconf -m prep SDfile
Find this compound or compounds like it in BindingDB:
Activity Spreadsheet -- Enzyme Inhibition Constant Data from BindingDB
Found 1 hit for monomerid = 412482
TargetInterleukin-2(Homo sapiens (Human))
Prcl Research
US Patent
LigandPNGBDBM412482(N-(5-(2-chloro-5-(1-methyl-1H- pyrazol-4-yl)phenyl...)
Affinity DataIC50:  14nM. Assay description: Human peripheral blood mononuclear cells (PBMCs) are prepared from heparinized human blood by separation over a Ficoll density gradient.PBMCs are sti...
Ligand Info
In DepthDetails US Patent