BDBM412513 (Z)-N-(5-(1-(4-bromophenyl)prop-1- en-1-yl)pyrazin-2-yl)-5-fluoro-4- methylnicotinamide::US10399967, Compound 146
SMILES C\C=C(\c1ccc(Br)cc1)c1cnc(NC(=O)c2cncc(F)c2C)cn1
InChI Key InChIKey=LPNGUNKXNPYWTD-CQPUUCJISA-N
Data  1 IC50
  Tab Delimited (TSV)   2D SDfile   Computed 3D by Vconf -m prep SDfile
Find this compound or compounds like it in BindingDB:
Activity Spreadsheet -- Enzyme Inhibition Constant Data from BindingDB
Found 1 hit for monomerid = 412513
TargetInterleukin-2(Homo sapiens (Human))
Prcl Research
US Patent
LigandPNGBDBM412513((Z)-N-(5-(1-(4-bromophenyl)prop-1- en-1-yl)pyrazin...)
Affinity DataIC50:  18nM. Assay description: Human peripheral blood mononuclear cells (PBMCs) are prepared from heparinized human blood by separation over a Ficoll density gradient.PBMCs are sti...
Ligand Info
In DepthDetails US Patent