BDBM412745 N-(3-fluoropyridin-4-yl)-2-(6-(trifluoromethyl)pyridin-2-yl)-7H-pyrrolo[2,3-d]pyrimidin-4-amine::US10399987, Example 10
SMILES Fc1cnccc1Nc1nc(nc2[nH]ccc12)-c1cccc(n1)C(F)(F)F
InChI Key InChIKey=KNTWBIUWHSYQJE-UHFFFAOYSA-N
Data  1 KI  4 IC50
PDB links: 1 PDB ID matches this monomer.
  Tab Delimited (TSV)   2D SDfile   Computed 3D by Vconf -m prep SDfile
Find this compound or compounds like it in BindingDB:
Activity Spreadsheet -- Enzyme Inhibition Constant Data from BindingDB
Found 5 hits for monomerid = 412745
TargetTGF-beta receptor type-1(Homo sapiens (Human))
Bristol-Myers Squibb
Curated by ChEMBL
LigandPNGBDBM412745(N-(3-fluoropyridin-4-yl)-2-(6-(trifluoromethyl)pyr...)
Affinity DataKi:  0.220nM. Assay description: Inhibition of human His-tagged TGFbetaR1 T204D mutant expressed in Sf9 insect cells after 1 hr by HTRF assay
Ligand InfoPurchasePDB
TargetTGF-beta receptor type-2(Homo sapiens (Human))
Bristol-Myer Squibb
US Patent
LigandPNGBDBM412745(N-(3-fluoropyridin-4-yl)-2-(6-(trifluoromethyl)pyr...)
Affinity DataIC50: >1.50E+4nM. Assay description: Assays are conducted in 1536-well plates and 2 mL reactions are prepared from addition of HIS-TGFβR1 T204D or HIS-TGFβR2 WT, anti-HIS detec...
Ligand InfoPurchasePDB
In DepthDetails US Patent
TargetTGF-beta receptor type-1 [4-503,T204D](Homo sapiens (Human))
Bristol-Myer Squibb
US Patent
LigandPNGBDBM412745(N-(3-fluoropyridin-4-yl)-2-(6-(trifluoromethyl)pyr...)
Affinity DataIC50:  0.560nM. Assay description: Assays are conducted in 1536-well plates and 2 mL reactions are prepared from addition of HIS-TGFβR1 T204D or HIS-TGFβR2 WT, anti-HIS detec...
Ligand InfoPurchasePDB
TargetTGF-beta receptor type-2(Homo sapiens (Human))
Bristol-Myer Squibb
US Patent
LigandPNGBDBM412745(N-(3-fluoropyridin-4-yl)-2-(6-(trifluoromethyl)pyr...)
Affinity DataIC50: >1.50E+4nM. Assay description: Inhibition of wild type His-tagged TGFbetaR2 (unknown origin) after 1 hr by HTRF assay
Ligand InfoPurchasePDB
In DepthDetails ArticlePubMed
TargetTGF-beta receptor type-1(Homo sapiens (Human))
Bristol-Myers Squibb
Curated by ChEMBL
LigandPNGBDBM412745(N-(3-fluoropyridin-4-yl)-2-(6-(trifluoromethyl)pyr...)
Affinity DataIC50:  0.550nM. Assay description: Inhibition of human His-tagged TGFbetaR1 T204D mutant expressed in Sf9 insect cells after 1 hr by HTRF assay
Ligand InfoPurchasePDB