BDBM414820 US10435405, Example 237::US10934288, Example 237
SMILES CCNCc1cccc(-c2cc3c(n[nH]c3cn2)-c2cnn(C)c2)c1C(F)(F)F
InChI Key InChIKey=BDJRTPMRPRSVDU-UHFFFAOYSA-N
Data  2 KI
  Tab Delimited (TSV)   2D SDfile   Computed 3D by Vconf -m prep SDfile
Find this compound or compounds like it in BindingDB:
Activity Spreadsheet -- Enzyme Inhibition Constant Data from BindingDB
Found 2 hits for monomerid = 414820
TargetMitogen-activated protein kinase kinase kinase kinase 1(Homo sapiens (Human))
Incyte
US Patent
LigandPNGBDBM414820(US10435405, Example 237 | US10934288, Example 237)
Affinity DataKi: <100nM. Assay description: A stock solution of 1 mM test compound was prepared in DMSO. The compound plate was prepared by 3-fold and 11-point serial dilutions. 0.1 μL of ...
Ligand InfoPC cidPC sid
In DepthDetails US Patent
TargetMitogen-activated protein kinase kinase kinase kinase 1(Homo sapiens (Human))
Incyte
US Patent
LigandPNGBDBM414820(US10435405, Example 237 | US10934288, Example 237)
Affinity DataKi: <100nM. Assay description: A stock solution of 1 mM test compound was prepared in DMSO. The compound plate was prepared by 3-fold and 11-point serial dilutions. 0.1 μL of ...
Ligand InfoPC cidPC sid
In DepthDetails US Patent