BDBM415421 Intermediate 1-2-11::US10428063, Example 21
SMILES CN1CCC(NCc2ccnc(N)c2)=C(C(=S)Nc2ccccc2)C1=O
InChI Key InChIKey=CKYNKJMNJPWAJU-UHFFFAOYSA-N
Data  1 IC50
  Tab Delimited (TSV)   2D SDfile   Computed 3D by Vconf -m prep SDfile
Find this compound or compounds like it in BindingDB:
Activity Spreadsheet -- Enzyme Inhibition Constant Data from BindingDB
Found 1 hit for monomerid = 415421
TargetMitotic checkpoint serine/threonine-protein kinase BUB1 [704-1085](Homo sapiens (Human))
Bayer Pharma Aktiengesellschaft
US Patent
LigandPNGBDBM415421(Intermediate 1-2-11 | US10428063, Example 21)
Affinity DataIC50:  170nM. Assay description: In a typical assay 11 different concentrations of each compound (0.1 nM, 0.33 nM, 1.1 nM, 3.8 nM, 13 nM, 44 nM, 0.15 μM, 0.51 μM, 1.7 μ...
Ligand InfoPC cidPC sid
In DepthDetails US Patent