BDBM415430 5-methyl-3-(phenylamino)-2-[3-(2,2,2-trifluoroethoxy)pyridin-4-yl]-1,5,6,7-tetrahydro-4H-pyrrolo[3,2-c]pyridin-4-one::US10428063, Example 30
SMILES CN1CCc2[nH]c(c(Nc3ccccc3)c2C1=O)-c1ccncc1OCC(F)(F)F
InChI Key InChIKey=UMBUKOUDYYBRIL-UHFFFAOYSA-N
Data  1 IC50
  Tab Delimited (TSV)   2D SDfile   Computed 3D by Vconf -m prep SDfile
Find this compound or compounds like it in BindingDB:
Activity Spreadsheet -- Enzyme Inhibition Constant Data from BindingDB
Found 1 hit for monomerid = 415430
TargetMitotic checkpoint serine/threonine-protein kinase BUB1 [704-1085](Homo sapiens (Human))
Bayer Pharma Aktiengesellschaft
US Patent
LigandPNGBDBM415430(5-methyl-3-(phenylamino)-2-[3-(2,2,2-trifluoroetho...)
Affinity DataIC50:  84.3nM. Assay description: In a typical assay 11 different concentrations of each compound (0.1 nM, 0.33 nM, 1.1 nM, 3.8 nM, 13 nM, 44 nM, 0.15 μM, 0.51 μM, 1.7 μ...
Ligand InfoPC cidPC sid
In DepthDetails US Patent