BDBM415439 2-[3-(cyclopropylmethoxy)pyridin-4-yl]-3-[(3-fluorophenyl)amino]-1,5,6,7-tetrahydro-4H-pyrrolo[3,2-c]pyridin-4-one::US10428063, Example 39
SMILES Fc1cccc(Nc2c([nH]c3CCNC(=O)c23)-c2ccncc2OCC2CC2)c1
InChI Key InChIKey=KHNSDFACFKOTPQ-UHFFFAOYSA-N
Data  1 IC50
  Tab Delimited (TSV)   2D SDfile   Computed 3D by Vconf -m prep SDfile
Find this compound or compounds like it in BindingDB:
Activity Spreadsheet -- Enzyme Inhibition Constant Data from BindingDB
Found 1 hit for monomerid = 415439
TargetMitotic checkpoint serine/threonine-protein kinase BUB1 [704-1085](Homo sapiens (Human))
Bayer Pharma Aktiengesellschaft
US Patent
LigandPNGBDBM415439(2-[3-(cyclopropylmethoxy)pyridin-4-yl]-3-[(3-fluor...)
Affinity DataIC50:  24.1nM. Assay description: In a typical assay 11 different concentrations of each compound (0.1 nM, 0.33 nM, 1.1 nM, 3.8 nM, 13 nM, 44 nM, 0.15 μM, 0.51 μM, 1.7 μ...
Ligand InfoPC cidPC sid
In DepthDetails US Patent