BDBM41629 N-(4-fluorophenyl)-2-thiophenecarboxamide::N-(4-fluorophenyl)thiophene-2-carboxamide::SR-01000392624-3::cid_531923
SMILES Fc1ccc(NC(=O)c2cccs2)cc1
InChI Key InChIKey=GCPZKOCHNSMRNY-UHFFFAOYSA-N
Data  2 IC50
  Tab Delimited (TSV)   2D SDfile   Computed 3D by Vconf -m prep SDfile
Find this compound or compounds like it in BindingDB:
Activity Spreadsheet -- Enzyme Inhibition Constant Data from BindingDB
Found 1 hit for monomerid = 41629
TargetSphingosine 1-phosphate receptor 2(Homo sapiens (Human))
The Scripps Research Institute Molecular Screening Center
Curated by PubChem BioAssay
LigandPNGBDBM41629(N-(4-fluorophenyl)-2-thiophenecarboxamide | N-(4-f...)
Affinity DataIC50: >4.00E+4nM. Assay description: Source (MLSCN Center Name): The Scripps Research Institute Molecular Screening Center Center Affiliation: The Scripps Research Institute (TSRI) Assay...
In DepthDetails PCBioAssay