BDBM41743 1-[2-(1-benzyl-2,5-dimethyl-pyrrol-3-yl)-2-keto-ethyl]-3-cyclopentyl-imidazolidine-2,4,5-trione::1-[2-(1-benzyl-2,5-dimethylpyrrol-3-yl)-2-oxoethyl]-3-cyclopentylimidazolidine-2,4,5-trione::1-cyclopentyl-3-[2-[2,5-dimethyl-1-(phenylmethyl)-3-pyrrolyl]-2-oxoethyl]imidazolidine-2,4,5-trione::1-cyclopentyl-3-[2-[2,5-dimethyl-1-(phenylmethyl)pyrrol-3-yl]-2-oxidanylidene-ethyl]imidazolidine-2,4,5-trione::SR-01000759075-1::cid_4781145
SMILES Cc1cc(C(=O)CN2C(=O)N(C3CCCC3)C(=O)C2=O)c(C)n1Cc1ccccc1
InChI Key InChIKey=XVCSWTJMTMWNNC-UHFFFAOYSA-N
Data  2 EC50
  Tab Delimited (TSV)   2D SDfile   Computed 3D by Vconf -m prep SDfile
Find this compound or compounds like it in BindingDB:
Activity Spreadsheet -- Enzyme Inhibition Constant Data from BindingDB
Found 1 hit for monomerid = 41743
TargetSphingosine 1-phosphate receptor 2(Homo sapiens (Human))
The Scripps Research Institute Molecular Screening Center
Curated by PubChem BioAssay
LigandPNGBDBM41743(1-[2-(1-benzyl-2,5-dimethyl-pyrrol-3-yl)-2-keto-et...)
Affinity DataEC50: >3.00E+4nM. Assay description: Source (MLSCN Center Name): The Scripps Research Institute Molecular Screening Center Center Affiliation: The Scripps Research Institute (TSRI) Assay...
In DepthDetails PCBioAssay