BDBM418331 US10457672, Compound 213
SMILES Fc1ccccc1C(=O)CCC(=O)c1ccc2OCOc2c1
InChI Key InChIKey=IDDSGDWRYPOTEP-UHFFFAOYSA-N
Data  1 EC50
  Tab Delimited (TSV)   2D SDfile   Computed 3D by Vconf -m prep SDfile
Find this compound or compounds like it in BindingDB:
Activity Spreadsheet -- Enzyme Inhibition Constant Data from BindingDB
Found 1 hit for monomerid = 418331
TargetCatenin beta-1/Protein Wnt-3a(Homo sapiens (Human))
Samumed
US Patent
LigandPNGBDBM418331(US10457672, Compound 213)
Affinity DataEC50:  18nM. Assay description: Compounds that enhance the Wnt activity, or Activators, were assayed as follows. Reporter cell lines were generated by stably transducing cells of co...
Ligand InfoPC cidPC sid
In DepthDetails US Patent