BDBM42290 2-(N-(3,4-dimethoxyphenyl)sulfonylanilino)-N-(2-oxolanylmethyl)acetamide::2-(N-(3,4-dimethoxyphenyl)sulfonylanilino)-N-(oxolan-2-ylmethyl)acetamide::2-(N-(3,4-dimethoxyphenyl)sulfonylanilino)-N-(tetrahydrofurfuryl)acetamide::2-[(3,4-Dimethoxy-benzenesulfonyl)-phenyl-amino]-N-(tetrahydro-furan-2-ylmethyl)-acetamide::2-[(3,4-dimethoxyphenyl)sulfonyl-phenyl-amino]-N-(oxolan-2-ylmethyl)ethanamide::MLS000033872::SMR000013914::cid_654500
SMILES COc1ccc(cc1OC)S(=O)(=O)N(CC(=O)NCC1CCCO1)c1ccccc1
InChI Key InChIKey=FUKOMMHZEZJDOZ-UHFFFAOYSA-N
Data  1 EC50
  Tab Delimited (TSV)   2D SDfile   Computed 3D by Vconf -m prep SDfile
Find this compound or compounds like it in BindingDB:
Activity Spreadsheet -- Enzyme Inhibition Constant Data from BindingDB
Found 1 hit for monomerid = 42290
TargetLysosomal acid glucosylceramidase(Homo sapiens (Human))
The Scripps Research Institute Molecular Screening Center
Curated by PubChem BioAssay
LigandPNGBDBM42290(2-(N-(3,4-dimethoxyphenyl)sulfonylanilino)-N-(2-ox...)
Affinity DataEC50: >5.00E+4nM. Assay description: Source (MLSCN Center Name): The Scripps Research Institute Molecular Screening Center Center Affiliation: The Scripps Research Institute, TSRI Assay ...
In DepthDetails PCBioAssay