BDBM427203 US10544136, Compound 7
SMILES FC(F)(F)c1ccc(cc1)-c1noc(n1)-c1ccnc(Cl)c1
InChI Key InChIKey=IHUXZYSLELKNQP-UHFFFAOYSA-N
Data  2 EC50
  Tab Delimited (TSV)   2D SDfile   Computed 3D by Vconf -m prep SDfile
Find this compound or compounds like it in BindingDB:
Activity Spreadsheet -- Enzyme Inhibition Constant Data from BindingDB
Found 2 hits for monomerid = 427203
TargetSphingosine 1-phosphate receptor 3(Homo sapiens (Human))
The Scripps Research Institute
US Patent
LigandPNGBDBM427203(US10544136, Compound 7)
Affinity DataEC50:  782nM. Assay description: The method involves contacting the receptor with a suitable concentration of an inventive compound to bring about activation of the receptor. The con...
In DepthDetails US Patent
TargetSphingosine 1-phosphate receptor 1(Homo sapiens (Human))
The Scripps Research Institute
US Patent
LigandPNGBDBM427203(US10544136, Compound 7)
Affinity DataEC50:  270nM. Assay description: The method involves contacting the receptor with a suitable concentration of an inventive compound to bring about activation of the receptor. The con...
In DepthDetails US Patent