BDBM427209 US10544136, Compound 11
SMILES COc1cc(OC)c(cc1OC)-c1nc(no1)-c1ccncc1
InChI Key InChIKey=KADNFUXYVFMFEF-UHFFFAOYSA-N
Data  1 EC50
  Tab Delimited (TSV)   2D SDfile   Computed 3D by Vconf -m prep SDfile
Find this compound or compounds like it in BindingDB:
Activity Spreadsheet -- Enzyme Inhibition Constant Data from BindingDB
Found 1 hit for monomerid = 427209
TargetSphingosine 1-phosphate receptor 1(Homo sapiens (Human))
The Scripps Research Institute
US Patent
LigandPNGBDBM427209(US10544136, Compound 11)
Affinity DataEC50:  6.50E+3nM. Assay description: The method involves contacting the receptor with a suitable concentration of an inventive compound to bring about activation of the receptor. The con...
In DepthDetails US Patent