BDBM427210 US10544136, Compound 14
SMILES CC(C)(C)c1cc(cc(c1)C(C)(C)C)-c1nc(no1)-c1ccc(cc1)S(N)(=O)=O
InChI Key InChIKey=HVDHJZCMOLBOCG-UHFFFAOYSA-N
Data  1 EC50
  Tab Delimited (TSV)   2D SDfile   Computed 3D by Vconf -m prep SDfile
Find this compound or compounds like it in BindingDB:
Activity Spreadsheet -- Enzyme Inhibition Constant Data from BindingDB
Found 1 hit for monomerid = 427210
TargetSphingosine 1-phosphate receptor 1(Homo sapiens (Human))
The Scripps Research Institute
US Patent
LigandPNGBDBM427210(US10544136, Compound 14)
Affinity DataEC50:  1.23E+4nM. Assay description: The method involves contacting the receptor with a suitable concentration of an inventive compound to bring about activation of the receptor. The con...
Ligand InfoPC cidPC sid
In DepthDetails US Patent