BDBM427238 US10544136, Compound 47
SMILES COc1cc(ccc1C)-c1noc(n1)-c1cc2ccccc2s1
InChI Key InChIKey=PZYDISFZXZKAOJ-UHFFFAOYSA-N
Data  1 EC50
  Tab Delimited (TSV)   2D SDfile   Computed 3D by Vconf -m prep SDfile
Find this compound or compounds like it in BindingDB:
Activity Spreadsheet -- Enzyme Inhibition Constant Data from BindingDB
Found 1 hit for monomerid = 427238
TargetSphingosine 1-phosphate receptor 1(Homo sapiens (Human))
The Scripps Research Institute
US Patent
LigandPNGBDBM427238(US10544136, Compound 47)
Affinity DataEC50:  3.18E+4nM. Assay description: The method involves contacting the receptor with a suitable concentration of an inventive compound to bring about activation of the receptor. The con...
Ligand InfoPC cidPC sid
In DepthDetails US Patent