BDBM430407 (S)-2-(4-(1-(2,3-dihydrobenzofuran-6-yl)ethyl)piperazin-1-yl)-4,5,6,7-tetrahydrothiazolo[5,4-c]pyridine and (R)-2-(4-(1-(2,3-dihydrobenzofuran-6-yl)ethyl)piperazin-1-yl)-4,5,6,7-tetrahydrothiazolo[5,4-c]pyridine::US10556902, No 17::US10556902, No 18
SMILES CC(N1CCN(CC1)c1nc2CCNCc2s1)c1ccc2CCOc2c1
InChI Key InChIKey=CCYHSWGUDVNJBB-UHFFFAOYSA-N
Data  2 IC50
  Tab Delimited (TSV)   2D SDfile   Computed 3D by Vconf -m prep SDfile
Find this compound or compounds like it in BindingDB:
Activity Spreadsheet -- Enzyme Inhibition Constant Data from BindingDB
Found 2 hits for monomerid = 430407
TargetProtein O-GlcNAcase(Homo sapiens (Human))
Asceneuron
US Patent
LigandPNGBDBM430407((S)-2-(4-(1-(2,3-dihydrobenzofuran-6-yl)ethyl)pipe...)
Affinity DataIC50:  5.50E+3nM. Assay description: 5 μl of the appropriate concentration of a solution of inhibitor in McIlvaine's Buffer (pH 6.5) in 2% DMSO (for a dose response curve calcul...
Ligand InfoPC cidPC sid
In DepthDetails US Patent
TargetProtein O-GlcNAcase(Homo sapiens (Human))
Asceneuron
US Patent
LigandPNGBDBM430407((S)-2-(4-(1-(2,3-dihydrobenzofuran-6-yl)ethyl)pipe...)
Affinity DataIC50: <50nM. Assay description: 5 μl of the appropriate concentration of a solution of inhibitor in McIlvaine's Buffer (pH 6.5) in 2% DMSO (for a dose response curve calcul...
Ligand InfoPC cidPC sid
In DepthDetails US Patent