BDBM430475 US10556902, No 83::US11612599, Compound 83
SMILES CC(N1CCN(CC1)c1ncc(cn1)C(O)C(F)(F)F)c1ccc2cccnc2n1
InChI Key InChIKey=UDZOOLTXUPDDLO-UHFFFAOYSA-N
Data  2 IC50
  Tab Delimited (TSV)   2D SDfile   Computed 3D by Vconf -m prep SDfile
Find this compound or compounds like it in BindingDB:
Activity Spreadsheet -- Enzyme Inhibition Constant Data from BindingDB
Found 2 hits for monomerid = 430475
TargetProtein O-GlcNAcase(Homo sapiens (Human))
Asceneuron
US Patent
LigandPNGBDBM430475(US10556902, No 83 | US11612599, Compound 83)
Affinity DataIC50: <50nM. Assay description: 5 μl of the appropriate concentration of a solution of inhibitor in McIlvaine's Buffer (pH 6.5) in 2% DMSO (for a dose response curve calcul...
Ligand InfoPC cidPC sid
In DepthDetails US Patent
TargetProtein O-GlcNAcase(Homo sapiens (Human))
Asceneuron
US Patent
LigandPNGBDBM430475(US10556902, No 83 | US11612599, Compound 83)
Affinity DataIC50: <50nM. Assay description: 5 μl of the appropriate concentration of a solution of inhibitor in McIlvaine's Buffer (pH 6.5) in 2% DMSO (for a dose response curve calcul...
Ligand InfoPC cidPC sid
In DepthDetails US Patent