BDBM43202 5-bromanyl-3-[(E)-3-(4-ethylphenyl)prop-2-enoyl]-2-oxidanyl-cyclohepta-2,4,6-trien-1-one::5-bromo-3-[(E)-3-(4-ethylphenyl)-1-oxoprop-2-enyl]-2-hydroxy-1-cyclohepta-2,4,6-trienone::5-bromo-3-[(E)-3-(4-ethylphenyl)acryloyl]-2-hydroxy-cyclohepta-2,4,6-trien-1-one::5-bromo-3-[(E)-3-(4-ethylphenyl)prop-2-enoyl]-2-hydroxycyclohepta-2,4,6-trien-1-one::5-bromo-3-[3-(4-ethylphenyl)acryloyl]-2-hydroxy-2,4,6-cycloheptatrien-1-one::MLS000537599::SMR000161461::cid_7314658
SMILES CCc1ccc(\C=C\C(=O)c2cc(Br)ccc(=O)c2O)cc1
InChI Key InChIKey=POFGZJDRQAJRPB-VQHVLOKHSA-N
Data  2 IC50  2 EC50
  Tab Delimited (TSV)   2D SDfile   Computed 3D by Vconf -m prep SDfile
Find this compound or compounds like it in BindingDB:
Activity Spreadsheet -- Enzyme Inhibition Constant Data from BindingDB
Found 4 hits for monomerid = 43202
TargetBcl-2-like protein 2(Homo sapiens (Human))
Nmmlsc
Curated by PubChem BioAssay
LigandPNGBDBM43202(5-bromanyl-3-[(E)-3-(4-ethylphenyl)prop-2-enoyl]-2...)
Affinity DataEC50:  5.21E+4nM. Assay description: University of New Mexico Assay Overview: Assay Support: NIH 1X01 MH079850-01 HTS to identify small molecule regulators of Bcl-2 family protein int...
In DepthDetails PCBioAssay
TargetC-C chemokine receptor type 6(Homo sapiens (Human))
Burnham Center For Chemical Genomics
Curated by PubChem BioAssay
LigandPNGBDBM43202(5-bromanyl-3-[(E)-3-(4-ethylphenyl)prop-2-enoyl]-2...)
Affinity DataIC50:  4.75E+4nM. Assay description: Data Source: Sanford-Burnham Center for Chemical Genomics (SBCCG) Source Affiliation: Sanford-Burnham Medical Research Institute(SBMRI, San Diego, CA...
In DepthDetails PCBioAssay
TargetBeta-galactosidase(Escherichia coli)
Burnham Center For Chemical Genomics
Curated by PubChem BioAssay
LigandPNGBDBM43202(5-bromanyl-3-[(E)-3-(4-ethylphenyl)prop-2-enoyl]-2...)
Affinity DataIC50: >6.66E+4nM. Assay description: Data Source: Sanford-Burnham Center for Chemical Genomics (SBCCG) Source Affiliation: Sanford-Burnham Medical Research Institute(SBMRI, San Diego, C...
In DepthDetails PCBioAssay
TargetApoptosis regulator Bcl-2(Homo sapiens (Human))
Nmmlsc
Curated by PubChem BioAssay
LigandPNGBDBM43202(5-bromanyl-3-[(E)-3-(4-ethylphenyl)prop-2-enoyl]-2...)
Affinity DataEC50:  7.64E+4nM. Assay description: University of New Mexico Assay Overview: Assay Support: NIH 1X01 MH079850-01 HTS to identify small molecule regulators of Bcl-2 family protein int...
In DepthDetails PCBioAssay