BDBM43309 N-(4-hydroxy-1-naphthalenyl)-3-(trifluoromethoxy)benzenesulfonamide::N-(4-hydroxy-1-naphthyl)-3-(trifluoromethoxy)benzenesulfonamide::N-(4-hydroxynaphthalen-1-yl)-3-(trifluoromethoxy)benzenesulfonamide::N-(4-oxidanylnaphthalen-1-yl)-3-(trifluoromethyloxy)benzenesulfonamide::PC-0599224::PCMD-CC-MCM-220::cid_16738588
SMILES Oc1ccc(NS(=O)(=O)c2cccc(OC(F)(F)F)c2)c2ccccc12
InChI Key InChIKey=JOPQBVXBLCIFSK-UHFFFAOYSA-N
Data  1 IC50
  Tab Delimited (TSV)   2D SDfile   Computed 3D by Vconf -m prep SDfile
Find this compound or compounds like it in BindingDB:
Activity Spreadsheet -- Enzyme Inhibition Constant Data from BindingDB
Found 1 hit for monomerid = 43309
TargetDNA-directed RNA polymerase subunit beta(Escherichia coli)
Pcmd
Curated by PubChem BioAssay
LigandPNGBDBM43309(N-(4-hydroxy-1-naphthalenyl)-3-(trifluoromethoxy)b...)
Affinity DataIC50: >5.00E+4nM. Assay description: Screening Center: Penn Center for Molecular Discovery Center Affiliation: University of Pennsylvania Network: Molecular Library Screening Center Netw...
In DepthDetails PCBioAssay