BDBM43454 MLS000729575::N-(2-chloranylpyridin-3-yl)-4-[4-(2-methoxyphenyl)-6-(trifluoromethyl)pyrimidin-2-yl]sulfonyl-butanamide::N-(2-chloro-3-pyridinyl)-4-[[4-(2-methoxyphenyl)-6-(trifluoromethyl)-2-pyrimidinyl]sulfonyl]butanamide::N-(2-chloro-3-pyridyl)-4-[4-(2-methoxyphenyl)-6-(trifluoromethyl)pyrimidin-2-yl]sulfonyl-butyramide::N-(2-chloropyridin-3-yl)-4-[4-(2-methoxyphenyl)-6-(trifluoromethyl)pyrimidin-2-yl]sulfonylbutanamide::N-(2-chloropyridin-3-yl)-4-{[4-(2-methoxyphenyl)-6-(trifluoromethyl)pyrimidin-2-yl]sulfonyl}butanamide::SMR000307852::cid_3441150
SMILES COc1ccccc1-c1cc(nc(n1)S(=O)(=O)CCCC(=O)Nc1cccnc1Cl)C(F)(F)F
InChI Key InChIKey=RGEBHFBBSLVSRR-UHFFFAOYSA-N
Data  6 IC50  2 EC50
  Tab Delimited (TSV)   2D SDfile   Computed 3D by Vconf -m prep SDfile
Find this compound or compounds like it in BindingDB:
Activity Spreadsheet -- Enzyme Inhibition Constant Data from BindingDB
Found 8 hits for monomerid = 43454
TargetE3 ubiquitin-protein ligase Mdm2(Homo sapiens (Human))
Pcmd
Curated by PubChem BioAssay
LigandPNGBDBM43454(MLS000729575 | N-(2-chloranylpyridin-3-yl)-4-[4-(2...)
Affinity DataEC50:  2.00E+3nM. Assay description: Molecular Library Screening Center Network (MLSCN) Penn Center for Molecular Discovery (PCMD) Assay Provider: Brent Stockwell, Columbia University ML...
In DepthDetails PCBioAssay
TargetSignal transducer and activator of transcription 3 [702-738,740-752](Homo sapiens (Human))
The Scripps Research Institute Molecular Screening Center
Curated by PubChem BioAssay
LigandPNGBDBM43454(MLS000729575 | N-(2-chloranylpyridin-3-yl)-4-[4-(2...)
Affinity DataIC50:  3.46E+4nM. Assay description: Source (MLPCN Center Name): The Scripps Research Institute Molecular Screening Center Center Affiliation: The Scripps Research Institute (TSRI) Assay...
In DepthDetails PCBioAssay
TargetSignal transducer and activator of transcription 1-alpha/beta(Homo sapiens (Human))
The Scripps Research Institute Molecular Screening Center
Curated by PubChem BioAssay
LigandPNGBDBM43454(MLS000729575 | N-(2-chloranylpyridin-3-yl)-4-[4-(2...)
Affinity DataIC50: >1.86E+4nM. Assay description: Source (MLPCN Center Name): The Scripps Research Institute Molecular Screening Center Center Affiliation: The Scripps Research Institute (TSRI) Assay...
In DepthDetails PCBioAssay
TargetGalanin receptor type 3(Homo sapiens (Human))
The Scripps Research Institute Molecular Screening Center
Curated by PubChem BioAssay
LigandPNGBDBM43454(MLS000729575 | N-(2-chloranylpyridin-3-yl)-4-[4-(2...)
Affinity DataIC50: >2.99E+4nM
In DepthDetails PCBioAssay
TargetDNA damage-inducible transcript 3 protein(Mus musculus)
Emory University
Curated by PubChem BioAssay
LigandPNGBDBM43454(MLS000729575 | N-(2-chloranylpyridin-3-yl)-4-[4-(2...)
Affinity DataIC50: >1.00E+4nM. Assay description: NIH Molecular Libraries Screening Centers Network [MLSCN] Emory Chemical Biology Discovery Center in MLSCN Assay provider: Dr. Randal Kaufman, Univer...
In DepthDetails PCBioAssay
TargetDNA damage-inducible transcript 3 protein(Mus musculus)
Emory University
Curated by PubChem BioAssay
LigandPNGBDBM43454(MLS000729575 | N-(2-chloranylpyridin-3-yl)-4-[4-(2...)
Affinity DataIC50: >1.00E+4nM. Assay description: NIH Molecular Libraries Screening Centers Network [MLSCN] Emory Chemical Biology Discovery Center in MLSCN Assay provider: Dr. Randal Kaufman, Univer...
In DepthDetails PCBioAssay
TargetX-box-binding protein 1(Homo sapiens (Human))
Emory University
Curated by PubChem BioAssay
LigandPNGBDBM43454(MLS000729575 | N-(2-chloranylpyridin-3-yl)-4-[4-(2...)
Affinity DataIC50:  8.77E+3nM. Assay description: NIH Molecular Libraries Screening Centers Network [MLSCN] Emory Chemical Biology Discovery Center in MLSCN Assay provider: Dr. Randal Kaufman, Univer...
In DepthDetails PCBioAssay
TargetG-protein coupled receptor 55(Homo sapiens (Human))
Burnham Center For Chemical Genomics
Curated by PubChem BioAssay
LigandPNGBDBM43454(MLS000729575 | N-(2-chloranylpyridin-3-yl)-4-[4-(2...)
Affinity DataEC50:  2.94E+3nM. Assay description: Data Source: Sanford-Burnham Center for Chemical Genomics (SBCCG) Source Affiliation: Sanford-Burnham Medical Research Institute (SBMRI, San Diego, C...
In DepthDetails PCBioAssay