BDBM43503 4-(4-benzylpiperazin-1-yl)-8-methyl-5H-pyrimido[5,4-b]indole::4-(4-benzylpiperazino)-8-methyl-5H-pyrimid[5,4-b]indole::8-methyl-4-[4-(phenylmethyl)-1-piperazinyl]-5H-pyrimido[5,4-b]indole::8-methyl-4-[4-(phenylmethyl)piperazin-1-yl]-5H-pyrimido[5,4-b]indole::MLS000078394::SMR000039900::cid_659001
SMILES Cc1ccc2[nH]c3c(ncnc3c2c1)N1CCN(Cc2ccccc2)CC1
InChI Key InChIKey=VCOWTYMXDKKCRD-UHFFFAOYSA-N
Data  2 IC50  3 EC50
  Tab Delimited (TSV)   2D SDfile   Computed 3D by Vconf -m prep SDfile
Find this compound or compounds like it in BindingDB:
Activity Spreadsheet -- Enzyme Inhibition Constant Data from BindingDB
Found 5 hits for monomerid = 43503
TargetSignal transducer and activator of transcription 3 [702-738,740-752](Homo sapiens (Human))
The Scripps Research Institute Molecular Screening Center
Curated by PubChem BioAssay
LigandPNGBDBM43503(4-(4-benzylpiperazin-1-yl)-8-methyl-5H-pyrimido[5,...)
Affinity DataIC50:  1.62E+4nM. Assay description: Source (MLPCN Center Name): The Scripps Research Institute Molecular Screening Center Center Affiliation: The Scripps Research Institute (TSRI) Assay...
In DepthDetails PCBioAssay
TargetSignal transducer and activator of transcription 1-alpha/beta(Homo sapiens (Human))
The Scripps Research Institute Molecular Screening Center
Curated by PubChem BioAssay
LigandPNGBDBM43503(4-(4-benzylpiperazin-1-yl)-8-methyl-5H-pyrimido[5,...)
Affinity DataIC50: >5.57E+4nM. Assay description: Source (MLPCN Center Name): The Scripps Research Institute Molecular Screening Center Center Affiliation: The Scripps Research Institute (TSRI) Assay...
In DepthDetails PCBioAssay
TargetSolute carrier family 12 member 5(Homo sapiens (Human))
Vanderbilt Screening Center For Gpcrs, Ion Channels and Transporters
Curated by PubChem BioAssay
LigandPNGBDBM43503(4-(4-benzylpiperazin-1-yl)-8-methyl-5H-pyrimido[5,...)
Affinity DataEC50:  3.25E+3nM. Assay description: Vanderbilt Screening Center for GPCRs, Ion Channels and Transporters Assay Provider: Eric Delpire Assay Provider Affliation: Vanderbilt University Gr...
In DepthDetails PCBioAssay
TargetSolute carrier family 12 member 5(Homo sapiens (Human))
Vanderbilt Screening Center For Gpcrs, Ion Channels and Transporters
Curated by PubChem BioAssay
LigandPNGBDBM43503(4-(4-benzylpiperazin-1-yl)-8-methyl-5H-pyrimido[5,...)
Affinity DataEC50:  3.10E+3nM. Assay description: Vanderbilt Screening Center for GPCRs, Ion Channels and Transporters Assay Provider: Eric Delpire Assay Provider Affliation: Vanderbilt University Gr...
In DepthDetails PCBioAssay
TargetSolute carrier family 12 member 5(Homo sapiens (Human))
Vanderbilt Screening Center For Gpcrs, Ion Channels and Transporters
Curated by PubChem BioAssay
LigandPNGBDBM43503(4-(4-benzylpiperazin-1-yl)-8-methyl-5H-pyrimido[5,...)
Affinity DataEC50:  2.94E+3nM. Assay description: Vanderbilt Screening Center for GPCRs, Ion Channels and Transporters Assay Provider: Eric Delpire Assay Provider Affliation: Vanderbilt University Gr...
In DepthDetails PCBioAssay