BDBM43516 3-(anilinosulfonyl)-4-methyl-N-{3-[methyl(methylsulfonyl)amino]phenyl}benzamide::4-methyl-N-[3-[methyl(methylsulfonyl)amino]phenyl]-3-(phenylsulfamoyl)benzamide::MLS000582661::N-[3-[mesyl(methyl)amino]phenyl]-4-methyl-3-(phenylsulfamoyl)benzamide::SMR000201362::cid_2231989
SMILES CN(c1cccc(NC(=O)c2ccc(C)c(c2)S(=O)(=O)Nc2ccccc2)c1)S(C)(=O)=O
InChI Key InChIKey=BFORCNXRHJXYOJ-UHFFFAOYSA-N
Data  2 IC50
  Tab Delimited (TSV)   2D SDfile   Computed 3D by Vconf -m prep SDfile
Find this compound or compounds like it in BindingDB:
Activity Spreadsheet -- Enzyme Inhibition Constant Data from BindingDB
Found 1 hit for monomerid = 43516
TargetSignal transducer and activator of transcription 3 [702-738,740-752](Homo sapiens (Human))
The Scripps Research Institute Molecular Screening Center
Curated by PubChem BioAssay
LigandPNGBDBM43516(3-(anilinosulfonyl)-4-methyl-N-{3-[methyl(methylsu...)
Affinity DataIC50: >5.57E+4nM. Assay description: Source (MLPCN Center Name): The Scripps Research Institute Molecular Screening Center Center Affiliation: The Scripps Research Institute (TSRI) Assay...
In DepthDetails PCBioAssay