BDBM43517 Isonicotinic acid N'-(1,3-diethyl-4,6-dioxo-2-thioxo-tetrahydro-pyrimidin-5-ylidenemethyl)-hydrazide::MLS000591305::N'-[(1,3-diethyl-4,6-diketo-2-thioxo-hexahydropyrimidin-5-ylidene)methyl]isonicotinohydrazide::N'-[(1,3-diethyl-4,6-dioxo-2-sulfanylidene-1,3-diazinan-5-ylidene)methyl]-4-pyridinecarbohydrazide::N'-[(1,3-diethyl-4,6-dioxo-2-sulfanylidene-1,3-diazinan-5-ylidene)methyl]pyridine-4-carbohydrazide::N'-[[1,3-diethyl-4,6-bis(oxidanylidene)-2-sulfanylidene-1,3-diazinan-5-ylidene]methyl]pyridine-4-carbohydrazide::SMR000218837::cid_5419737
SMILES [#6]-[#6]-[#7]-1-[#6](=S)-[#7](-[#6]-[#6])-[#6](=O)\[#6](=[#6]/[#7]-[#7]-[#6](=O)-c2ccncc2)-[#6]-1=O
InChI Key InChIKey=PNAMZPZFGHPTBP-UHFFFAOYSA-N
Data  2 IC50
  Tab Delimited (TSV)   2D SDfile   Computed 3D by Vconf -m prep SDfile
Find this compound or compounds like it in BindingDB:
Activity Spreadsheet -- Enzyme Inhibition Constant Data from BindingDB
Found 2 hits for monomerid = 43517
TargetSignal transducer and activator of transcription 1-alpha/beta(Homo sapiens (Human))
The Scripps Research Institute Molecular Screening Center
Curated by PubChem BioAssay
LigandPNGBDBM43517(Isonicotinic acid N'-(1,3-diethyl-4,6-dioxo-2-...)
Affinity DataIC50:  4.42E+3nM. Assay description: Source (MLPCN Center Name): The Scripps Research Institute Molecular Screening Center Center Affiliation: The Scripps Research Institute (TSRI) Assay...
In DepthDetails PCBioAssay
TargetSignal transducer and activator of transcription 3 [702-738,740-752](Homo sapiens (Human))
The Scripps Research Institute Molecular Screening Center
Curated by PubChem BioAssay
LigandPNGBDBM43517(Isonicotinic acid N'-(1,3-diethyl-4,6-dioxo-2-...)
Affinity DataIC50: >5.57E+4nM. Assay description: Source (MLPCN Center Name): The Scripps Research Institute Molecular Screening Center Center Affiliation: The Scripps Research Institute (TSRI) Assay...
In DepthDetails PCBioAssay