BDBM43539 (2R,3R,4S)-2-ethoxy-4-(4-ethynylphenyl)-3-(3-hydroxypropyl)-3,4-dihydro-2H-pyran-6-carboxylic acid allyl ester::(2R,3R,4S)-2-ethoxy-4-(4-ethynylphenyl)-3-(3-hydroxypropyl)-3,4-dihydro-2H-pyran-6-carboxylic acid prop-2-enyl ester::(2R,3R,4S)-allyl 2-ethoxy-4-(4-ethynylphenyl)-3-(3-hydroxypropyl)-3,4-dihydro-2H-pyran-6-carboxylate::MLS000766370::SMR000389513::cid_16195760::prop-2-enyl (2R,3R,4S)-2-ethoxy-4-(4-ethynylphenyl)-3-(3-hydroxypropyl)-3,4-dihydro-2H-pyran-6-carboxylate::prop-2-enyl (2R,3R,4S)-2-ethoxy-4-(4-ethynylphenyl)-3-(3-oxidanylpropyl)-3,4-dihydro-2H-pyran-6-carboxylate
SMILES CCO[C@@H]1OC(=C[C@@H]([C@H]1CCCO)c1ccc(cc1)C#C)C(=O)OCC=C
InChI Key InChIKey=YEOYHFGEGGZHBB-WOIUINJBSA-N
Data  2 IC50
  Tab Delimited (TSV)   2D SDfile   Computed 3D by Vconf -m prep SDfile
Find this compound or compounds like it in BindingDB:
Activity Spreadsheet -- Enzyme Inhibition Constant Data from BindingDB
Found 2 hits for monomerid = 43539
TargetSignal transducer and activator of transcription 1-alpha/beta(Homo sapiens (Human))
The Scripps Research Institute Molecular Screening Center
Curated by PubChem BioAssay
LigandPNGBDBM43539((2R,3R,4S)-2-ethoxy-4-(4-ethynylphenyl)-3-(3-hydro...)
Affinity DataIC50:  1.19E+4nM. Assay description: Source (MLPCN Center Name): The Scripps Research Institute Molecular Screening Center Center Affiliation: The Scripps Research Institute (TSRI) Assay...
In DepthDetails PCBioAssay
TargetSignal transducer and activator of transcription 3 [702-738,740-752](Homo sapiens (Human))
The Scripps Research Institute Molecular Screening Center
Curated by PubChem BioAssay
LigandPNGBDBM43539((2R,3R,4S)-2-ethoxy-4-(4-ethynylphenyl)-3-(3-hydro...)
Affinity DataIC50: >5.57E+4nM. Assay description: Source (MLPCN Center Name): The Scripps Research Institute Molecular Screening Center Center Affiliation: The Scripps Research Institute (TSRI) Assay...
In DepthDetails PCBioAssay