BDBM43614 2-(2-keto-4-methyl-pyrimid[1,2-b]indazol-6-yl)-N,N-dipropyl-acetamide::2-(4-methyl-2-oxidanylidene-pyrimido[1,2-b]indazol-6-yl)-N,N-dipropyl-ethanamide::2-(4-methyl-2-oxo-6-pyrimido[1,2-b]indazolyl)-N,N-dipropylacetamide::2-(4-methyl-2-oxopyrimido[1,2-b]indazol-6-yl)-N,N-dipropylacetamide::MLS000522785::SMR000128051::cid_4106305
SMILES CCCN(CCC)C(=O)Cn1c2ccccc2c2nc(=O)cc(C)n12
InChI Key InChIKey=OISRYUZWHSXJLE-UHFFFAOYSA-N
Data  1 IC50  1 EC50
  Tab Delimited (TSV)   2D SDfile   Computed 3D by Vconf -m prep SDfile
Find this compound or compounds like it in BindingDB:
Activity Spreadsheet -- Enzyme Inhibition Constant Data from BindingDB
Found 2 hits for monomerid = 43614
TargetSignal transducer and activator of transcription 1-alpha/beta(Homo sapiens (Human))
The Scripps Research Institute Molecular Screening Center
Curated by PubChem BioAssay
LigandPNGBDBM43614(2-(2-keto-4-methyl-pyrimid[1,2-b]indazol-6-yl)-N,N...)
Affinity DataEC50: >5.57E+4nM. Assay description: Source (MLPCN Center Name): The Scripps Research Institute Molecular Screening Center Center Affiliation: The Scripps Research Institute (TSRI) Assay...
In DepthDetails PCBioAssay
TargetSignal transducer and activator of transcription 3 [702-738,740-752](Homo sapiens (Human))
The Scripps Research Institute Molecular Screening Center
Curated by PubChem BioAssay
LigandPNGBDBM43614(2-(2-keto-4-methyl-pyrimid[1,2-b]indazol-6-yl)-N,N...)
Affinity DataIC50:  174nM. Assay description: Source (MLPCN Center Name): The Scripps Research Institute Molecular Screening Center Center Affiliation: The Scripps Research Institute (TSRI) Assay...
In DepthDetails PCBioAssay