BDBM43637 2-methyl-6-[1-(2-methylphenyl)-1,3,4,9-tetrahydropyrido[3,4-b]indole-2-carbonyl]pyridazin-3-one::2-methyl-6-[1-(o-tolyl)-1,3,4,9-tetrahydro-beta-carboline-2-carbonyl]pyridazin-3-one::2-methyl-6-[[1-(2-methylphenyl)-1,3,4,9-tetrahydropyrido[3,4-b]indol-2-yl]-oxomethyl]-3-pyridazinone::2-methyl-6-[[1-(2-methylphenyl)-1,3,4,9-tetrahydropyrido[3,4-b]indol-2-yl]carbonyl]pyridazin-3-one::2-methyl-6-{[1-(2-methylphenyl)-1,3,4,9-tetrahydro-2H-beta-carbolin-2-yl]carbonyl}pyridazin-3(2H)-one::MLS000773203::SMR000316991::cid_16191466
SMILES Cc1ccccc1C1N(CCc2c1[nH]c1ccccc21)C(=O)c1ccc(=O)n(C)n1
InChI Key InChIKey=UXHLBAUIGULQHR-UHFFFAOYSA-N
Data  1 IC50  1 EC50
  Tab Delimited (TSV)   2D SDfile   Computed 3D by Vconf -m prep SDfile
Find this compound or compounds like it in BindingDB:
Activity Spreadsheet -- Enzyme Inhibition Constant Data from BindingDB
Found 2 hits for monomerid = 43637
TargetSignal transducer and activator of transcription 1-alpha/beta(Homo sapiens (Human))
The Scripps Research Institute Molecular Screening Center
Curated by PubChem BioAssay
LigandPNGBDBM43637(2-methyl-6-[1-(2-methylphenyl)-1,3,4,9-tetrahydrop...)
Affinity DataEC50: >5.57E+4nM. Assay description: Source (MLPCN Center Name): The Scripps Research Institute Molecular Screening Center Center Affiliation: The Scripps Research Institute (TSRI) Assay...
In DepthDetails PCBioAssay
TargetSignal transducer and activator of transcription 3 [702-738,740-752](Homo sapiens (Human))
The Scripps Research Institute Molecular Screening Center
Curated by PubChem BioAssay
LigandPNGBDBM43637(2-methyl-6-[1-(2-methylphenyl)-1,3,4,9-tetrahydrop...)
Affinity DataIC50:  4.19E+3nM. Assay description: Source (MLPCN Center Name): The Scripps Research Institute Molecular Screening Center Center Affiliation: The Scripps Research Institute (TSRI) Assay...
In DepthDetails PCBioAssay