BDBM438742 N-{1-[(4S)-7-(3,5-dimethylisoxazol-4-yl)- 4-pyridin-2-yl-4,5-dihydroimidazo[1,5,4- de][1,4]benzoxazin-2-yl]piperidin-4-yl}- N,N',N'-trimethylurea::US10618910, Example 21
SMILES CN(C)C(=O)N(C)C1CCN(CC1)c1nc2ccc(-c3c(C)noc3C)c3OC[C@H](c4ccccn4)n1c23
InChI Key InChIKey=WGVACKKKDBPNCF-HSZRJFAPSA-N
Data  2 IC50
  Tab Delimited (TSV)   2D SDfile   Computed 3D by Vconf -m prep SDfile
Find this compound or compounds like it in BindingDB:
Activity Spreadsheet -- Enzyme Inhibition Constant Data from BindingDB
Found 2 hits for monomerid = 438742
TargetBromodomain-containing protein 4 [342-460](Homo sapiens (Human))
Incyte
US Patent
LigandPNGBDBM438742(N-{1-[(4S)-7-(3,5-dimethylisoxazol-4-yl)- 4-pyridi...)
Affinity DataIC50: <25nM. Assay description: BRD4-BD1 and BRD4-BD2 assays were conducted in white 384-well polystyrene plate in a final volume of 20 μL for BD1 and 40 μL for BD2. Inhib...
Ligand InfoPC cidPC sid
In DepthDetails US Patent
TargetBromodomain-containing protein 4 [49-170](Homo sapiens (Human))
Incyte
US Patent
LigandPNGBDBM438742(N-{1-[(4S)-7-(3,5-dimethylisoxazol-4-yl)- 4-pyridi...)
Affinity DataIC50: <25nM. Assay description: BRD4-BD1 and BRD4-BD2 assays were conducted in white 384-well polystyrene plate in a final volume of 20 μL for BD1 and 40 μL for BD2. Inhib...
Ligand InfoPC cidPC sid
In DepthDetails US Patent